• Boudewijn Rempt's avatar
    Try to fix the the jenkins build · adf02710
    Boudewijn Rempt authored
    [2019-04-22T08:29:04.736Z] Scanning dependencies of target KisCompositionBenchmark
    [2019-04-22T08:29:04.993Z] [ 43%] Building CXX object benchmarks/CMakeFiles/KisCompositionBenchmark.dir/kis_composition_benchmark.cpp.o
    [2019-04-22T08:29:07.539Z] In file included from /usr/include/boost/random/detail/integer_log2.hpp:19,
    [2019-04-22T08:29:07.539Z]                  from /usr/include/boost/random/detail/large_arithmetic.hpp:19,
    [2019-04-22T08:29:07.539Z]                  from /usr/include/boost/random/detail/const_mod.hpp:23,
    [2019-04-22T08:29:07.539Z]                  from /usr/include/boost/random/detail/seed_impl.hpp:26,
    [2019-04-22T08:29:07.539Z]                  from /usr/include/boost/random/mersenne_twister.hpp:30,
    [2019-04-22T08:29:07.539Z]                  from /home/jenkins/workspace/Extragear/krita/kf5-qt5 SUSEQt5.10/benchmarks/kis_composition_benchmark.cpp:92:
    [2019-04-22T08:29:07.539Z] /usr/include/boost/pending/integer_log2.hpp:7:59: note: #pragma message: This header is deprecated. Use <boost/integer/integer_log2.hpp> instead.
    [2019-04-22T08:29:07.539Z]  BOOST_HEADER_DEPRECATED("<boost/integer/integer_log2.hpp>");
    [2019-04-22T08:29:07.540Z]                                                            ^
    [2019-04-22T08:29:07.540Z] /home/jenkins/workspace/Extragear/krita/kf5-qt5 SUSEQt5.10/benchmarks/kis_composition_benchmark.cpp: In member function ���void KisCompositionBenchmark::compareAlphaDarkenOps()���:
    [2019-04-22T08:29:07.540Z] /home/jenkins/workspace/Extragear/krita/kf5-qt5 SUSEQt5.10/benchmarks/kis_composition_benchmark.cpp:645:72: error: ���KoAlphaDarkenParamsWrapperCreamy��� was not declared in this scope
    [2019-04-22T08:29:07.540Z]      KoCompositeOp *opExp = new KoCompositeOpAlphaDarken<KoBgrU8Traits, KoAlphaDarkenParamsWrapperCreamy>(cs);
    [2019-04-22T08:29:07.540Z]                                                                         ^~~~~~~~~~~~~~~~~~~~~~~~~~~~~~~~
    [2019-04-22T08:29:07.540Z] /home/jenkins/workspace/Extragear/krita/kf5-qt5 SUSEQt5.10/benchmarks/kis_composition_benchmark.cpp:645:104: error: template argument 2 is invalid
    [2019-04-22T08:29:07.540Z]      KoCompositeOp *opExp = new KoCompositeOpAlphaDarken<KoBgrU8Traits, KoAlphaDarkenParamsWrapperCreamy>(cs);
    [2019-04-22T08:29:07.540Z]                                                                                                         ^
    [2019-04-22T08:29:07.540Z] /home/jenkins/workspace/Extragear/krita/kf5-qt5 SUSEQt5.10/benchmarks/kis_composition_benchmark.cpp: In member function ���void KisCompositionBenchmark::compareRgbF32AlphaDarkenOps()���:
    [2019-04-22T08:29:07.540Z] /home/jenkins/workspace/Extragear/krita/kf5-qt5 SUSEQt5.10/benchmarks/kis_composition_benchmark.cpp:657:73: error: ���KoAlphaDarkenParamsWrapperCreamy��� was not declared in this scope
    [2019-04-22T08:29:07.540Z]      KoCompositeOp *opExp = new KoCompositeOpAlphaDarken<KoRgbF32Traits, KoAlphaDarkenParamsWrapperCreamy>(cs);
    [2019-04-22T08:29:07.540Z]                                                                          ^~~~~~~~~~~~~~~~~~~~~~~~~~~~~~~~
    [2019-04-22T08:29:07.540Z] /home/jenkins/workspace/Extragear/krita/kf5-qt5 SUSEQt5.10/benchmarks/kis_composition_benchmark.cpp:657:105: error: template argument 2 is invalid
    [2019-04-22T08:29:07.540Z]      KoCompositeOp *opExp = new KoCompositeOpAlphaDarken<KoRgbF32Traits, KoAlphaDarkenParamsWrapperCreamy>(cs);
    [2019-04-22T08:29:07.540Z]                                                                                                          ^
    [2019-04-22T08:29:07.540Z] /home/jenkins/workspace/Extragear/krita/kf5-qt5 SUSEQt5.10/benchmarks/kis_composition_benchmark.cpp: In member function ���void KisCompositionBenchmark::compareAlphaDarkenOpsNoMask()���:
    [2019-04-22T08:29:07.540Z] /home/jenkins/workspace/Extragear/krita/kf5-qt5 SUSEQt5.10/benchmarks/kis_composition_benchmark.cpp:669:72: error: ���KoAlphaDarkenParamsWrapperCreamy��� was not declared in this scope
    [2019-04-22T08:29:07.540Z]      KoCompositeOp *opExp = new KoCompositeOpAlphaDarken<KoBgrU8Traits, KoAlphaDarkenParamsWrapperCreamy>(cs);
    [2019-04-22T08:29:07.540Z]                                                                         ^~~~~~~~~~~~~~~~~~~~~~~~~~~~~~~~
    [2019-04-22T08:29:07.540Z] /home/jenkins/workspace/Extragear/krita/kf5-qt5 SUSEQt5.10/benchmarks/kis_composition_benchmark.cpp:669:104: error: template argument 2 is invalid
    [2019-04-22T08:29:07.540Z]      KoCompositeOp *opExp = new KoCompositeOpAlphaDarken<KoBgrU8Traits, KoAlphaDarkenParamsWrapperCreamy>(cs);
    [2019-04-22T08:29:07.540Z]                                                                                                         ^
    [2019-04-22T08:29:07.540Z] /home/jenkins/workspace/Extragear/krita/kf5-qt5 SUSEQt5.10/benchmarks/kis_composition_benchmark.cpp: In member function ���void KisCompositionBenchmark::testRgb8CompositeAlphaDarkenLegacy()���:
    [2019-04-22T08:29:07.540Z] /home/jenkins/workspace/Extragear/krita/kf5-qt5 SUSEQt5.10/benchmarks/kis_composition_benchmark.cpp:716:69: error: ���KoAlphaDarkenParamsWrapperCreamy��� was not declared in this scope
    [2019-04-22T08:29:07.540Z]      KoCompositeOp *op = new KoCompositeOpAlphaDarken<KoBgrU8Traits, KoAlphaDarkenParamsWrapperCreamy>(cs);
    [2019-04-22T08:29:07.540Z]                                                                      ^~~~~~~~~~~~~~~~~~~~~~~~~~~~~~~~
    [2019-04-22T08:29:07.540Z] /home/jenkins/workspace/Extragear/krita/kf5-qt5 SUSEQt5.10/benchmarks/kis_composition_benchmark.cpp:716:101: error: template argument 2 is invalid
    [2019-04-22T08:29:07.540Z]      KoCompositeOp *op = new KoCompositeOpAlphaDarken<KoBgrU8Traits, KoAlphaDarkenParamsWrapperCreamy>(cs);
    [2019-04-22T08:29:07.540Z]                                                                                                      ^
    [2019-04-22T08:29:07.540Z] /home/jenkins/workspace/Extragear/krita/kf5-qt5 SUSEQt5.10/benchmarks/kis_composition_benchmark.cpp: In member function ���void KisCompositionBenchmark::testRgbF32CompositeAlphaDarkenLegacy()���:
    [2019-04-22T08:29:07.540Z] /home/jenkins/workspace/Extragear/krita/kf5-qt5 SUSEQt5.10/benchmarks/kis_composition_benchmark.cpp:748:70: error: ���KoAlphaDarkenParamsWrapperCreamy��� was not declared in this scope
    [2019-04-22T08:29:07.540Z]      KoCompositeOp *op = new KoCompositeOpAlphaDarken<KoRgbF32Traits, KoAlphaDarkenParamsWrapperCreamy>(cs);
    [2019-04-22T08:29:07.540Z]                                                                       ^~~~~~~~~~~~~~~~~~~~~~~~~~~~~~~~
    [2019-04-22T08:29:07.540Z] /home/jenkins/workspace/Extragear/krita/kf5-qt5 SUSEQt5.10/benchmarks/kis_composition_benchmark.cpp:748:102: error: template argument 2 is invalid
    [2019-04-22T08:29:07.540Z]      KoCompositeOp *op = new KoCompositeOpAlphaDarken<KoRgbF32Traits, KoAlphaDarkenParamsWrapperCreamy>(cs);
    [2019-04-22T08:29:07.540Z]                                                                                                       ^
    [2019-04-22T08:29:07.540Z] make[2]: *** [benchmarks/CMakeFiles/KisCompositionBenchmark.dir/build.make:63: benchmarks/CMakeFiles/KisCompositionBenchmark.dir/kis_composition_benchmark.cpp.o] Error 1
    [2019-04-22T08:29:07.540Z] make[1]: *** [CMakeFiles/Makefile2:44556: benchmarks/CMakeFiles/KisCompositionBenchmark.dir/all] Error 2
    [2019-04-22T08:29:07.540Z] make: *** [Makefile:141: all] Error 2
    adf02710
Name
Last commit
Last update
..
data Loading commit data...
CMakeLists.txt Loading commit data...
KisAnimationRenderingBenchmark.cpp Loading commit data...
KisAnimationRenderingBenchmark.h Loading commit data...
kis_bcontrast_benchmark.cpp Loading commit data...
kis_bcontrast_benchmark.h Loading commit data...
kis_benchmark_values.h Loading commit data...
kis_blur_benchmark.cpp Loading commit data...
kis_blur_benchmark.h Loading commit data...
kis_composition_benchmark.cpp Loading commit data...
kis_composition_benchmark.h Loading commit data...
kis_datamanager_benchmark.cpp Loading commit data...
kis_datamanager_benchmark.h Loading commit data...
kis_fast_math_benchmark.cpp Loading commit data...
kis_fast_math_benchmark.h Loading commit data...
kis_filter_selections_benchmark.cpp Loading commit data...
kis_filter_selections_benchmark.h Loading commit data...
kis_floodfill_benchmark.cpp Loading commit data...
kis_floodfill_benchmark.h Loading commit data...
kis_gradient_benchmark.cpp Loading commit data...
kis_gradient_benchmark.h Loading commit data...
kis_hline_iterator_benchmark.cpp Loading commit data...
kis_hline_iterator_benchmark.h Loading commit data...
kis_level_filter_benchmark.cpp Loading commit data...
kis_level_filter_benchmark.h Loading commit data...
kis_low_memory_benchmark.cpp Loading commit data...
kis_low_memory_benchmark.h Loading commit data...
kis_low_memory_benchmark_show_report.m Loading commit data...
kis_mask_generator_benchmark.cpp Loading commit data...
kis_mask_generator_benchmark.h Loading commit data...
kis_painter_benchmark.cpp Loading commit data...
kis_painter_benchmark.h Loading commit data...
kis_projection_benchmark.cpp Loading commit data...
kis_projection_benchmark.h Loading commit data...
kis_random_iterator_benchmark.cpp Loading commit data...
kis_random_iterator_benchmark.h Loading commit data...
kis_stroke_benchmark.cpp Loading commit data...
kis_stroke_benchmark.h Loading commit data...
kis_thumbnail_benchmark.cpp Loading commit data...
kis_thumbnail_benchmark.h Loading commit data...
kis_vline_iterator_benchmark.cpp Loading commit data...
kis_vline_iterator_benchmark.h Loading commit data...
runAllRandomTests.sh Loading commit data...