Show QR codes for contacts

9 jobs for feature/contact-qr-code in 16 minutes (queued for 14 minutes and 27 seconds)
latest
Status Job ID Name Coverage
  Test
passed #44770
clazy

00:01:03

passed #44771
qmllint

00:00:25

 
  Build
passed #44774
archlinux

00:01:04

passed #44773
debian-sid

00:00:53

passed #44772
neon-bionic

00:01:03

 
  Deploy
failed #44777
allowed to fail
android

00:09:03

failed #44775
linux-appimage

00:00:32

failed #44778
allowed to fail
mac-osxcross

00:00:34

failed #44776
allowed to fail
windows-mxe

00:01:18

 
Name Stage Failure
failed
mac-osxcross Deploy
File exists, skip copy: "bin/kaidan.app/Contents/PlugIns/quick/libqtquickcontrols2materialstyleplugin.dylib"
File exists, skip copy: "bin/kaidan.app/Contents/PlugIns/quick/libqtquickcontrols2universalstyleplugin.dylib"
ERROR: Could not find bundle binary for "bin/kaidan.app"
ERROR: "error: /opt/osxcross/target/bin/x86_64-apple-darwin15-strip: can't open file: (No such file or directory)\n"
ERROR: ""
error: x86_64-apple-darwin15-install_name_tool: can't open file: bin/kaidan.app/Contents/MacOS/kaidan (No such file or directory)
Running after_script
Uploading artifacts for failed job
ERROR: Job failed: exit code 1
failed
android Deploy

** (inkscape:10100): CRITICAL **: 13:07:33.017: dbus_g_connection_register_g_object: assertion 'connection != NULL' failed
/builds/melvo/kaidan/src/kaidan/utils/render-logos.sh: line 12: advpng: command not found
/opt/helpers/create-apk: line 15: pushd: build-arm/kaidan: No such file or directory
mv: cannot stat '/builds/melvo/kaidan/build-arm64/kaidan/kaidan_build_apk/build/outputs/apk/debug/kaidan_build_apk-debug.apk': No such file or directory
mv: cannot stat '/builds/melvo/kaidan/build-arm/kaidan/kaidan_build_apk/build/outputs/apk/debug/kaidan_build_apk-debug.apk': No such file or directory
Running after_script
Uploading artifacts for failed job
ERROR: Job failed: exit code 1
failed
windows-mxe Deploy
[ 11%] Built target translations
make[2]: *** No rule to make target '../3rdparty/breeze-icons/icons/actions/22/view-barcode-qr.svg', needed by 'CMakeFiles/kaidan_autogen'. Stop.
make[1]: *** [CMakeFiles/Makefile2:238: CMakeFiles/kaidan_autogen.dir/all] Error 2
make: *** [Makefile:95: all] Error 2
$ mv build/bin/kaidan.exe kaidan.exe
mv: cannot stat 'build/bin/kaidan.exe': No such file or directory
Running after_script
Uploading artifacts for failed job
ERROR: Job failed: exit code 1
failed
linux-appimage Deploy
[ 25%] Generating qrc source qrc_kaidan_i18n.cpp
make[2]: *** No rule to make target '../3rdparty/breeze-icons/icons/actions/22/view-barcode-qr.svg', needed by 'kaidan_autogen/EWIEGA46WW/qrc_kirigami-icons.cpp'. Stop.
CMakeFiles/Makefile2:104: recipe for target 'CMakeFiles/kaidan.dir/all' failed
make[1]: *** [CMakeFiles/kaidan.dir/all] Error 2
make: *** [all] Error 2
Makefile:140: recipe for target 'all' failed
Running after_script
Uploading artifacts for failed job
ERROR: Job failed: exit code 1