Add summary to documentation for releasing new Kaidan version and correct false instructions

11 jobs for doc/release in 31 minutes and 31 seconds (queued for 10 minutes and 4 seconds)
Status Job ID Name Coverage
  Test
passed #12551
clazy

00:00:58

passed #12552
qmllint

00:00:17

 
  Build
passed #12556
archlinux

00:01:34

passed #12555
debian-sid

00:00:52

passed #12554
neon-bionic

00:00:58

passed #12553
ubuntu-trusty

00:00:52

 
  Deploy
failed #12560
allowed to fail
android

00:03:16

failed #12558
allowed to fail
click-xenial

00:04:11

passed #12557
allowed to fail
linux-appimage

00:07:21

passed #12561
allowed to fail
mac-osxcross

00:05:46

passed #12559
allowed to fail
windows-mxe

00:05:22

 
Name Stage Failure
failed
android Deploy
1 error generated.
core/CMakeFiles/ZXingCore.dir/build.make:1115: recipe for target 'core/CMakeFiles/ZXingCore.dir/src/oned/rss/ODRSSReaderHelper.cpp.o' failed
make[2]: *** [core/CMakeFiles/ZXingCore.dir/src/oned/rss/ODRSSReaderHelper.cpp.o] Error 1
make[2]: *** Waiting for unfinished jobs....
make[1]: *** [core/CMakeFiles/ZXingCore.dir/all] Error 2
CMakeFiles/Makefile2:90: recipe for target 'core/CMakeFiles/ZXingCore.dir/all' failed
Makefile:129: recipe for target 'all' failed
make: *** [all] Error 2
ERROR: Job failed: exit code 1
failed
click-xenial Deploy
core/CMakeFiles/ZXingCore.dir/build.make:2006: recipe for target 'core/CMakeFiles/ZXingCore.dir/src/oned/rss/ODRSSReaderHelper.cpp.o' failed
make[1]: *** [core/CMakeFiles/ZXingCore.dir/all] Error 2
CMakeFiles/Makefile2:85: recipe for target 'core/CMakeFiles/ZXingCore.dir/all' failed
make: *** [all] Error 2
Makefile:127: recipe for target 'all' failed
Building qxmpp
Building zxing-cpp
Command '['bash', '-c', 'make -j2']' returned non-zero exit status 2
ERROR: Job failed: exit code 1