It compiles fine with QT_NO_KEYWORDS

2 jobs for master in 9 minutes and 12 seconds (queued for 81 minutes and 51 seconds)
Status Job ID Name Coverage
  Build
failed #89702
build_clazy_clang_tidy

00:04:46

passed #89701
linux kf5-qt5 qt5.15

00:04:25

0.0%
 
Name Stage Failure
failed
build_clazy_clang_tidy Build
make[2]: *** [calendarjanitor/CMakeFiles/calendarjanitor.dir/build.make:134: calendarjanitor/CMakeFiles/calendarjanitor.dir/main.cpp.o] Error 254
make[1]: *** [CMakeFiles/Makefile2:251: calendarjanitor/CMakeFiles/calendarjanitor.dir/all] Error 2
make: *** [Makefile:160: all] Error 2
Uploading artifacts for failed job
Uploading artifacts...
WARNING: JUnitTestResults.xml: no matching files
ERROR: No files to upload
Cleaning up file based variables
ERROR: Job failed: exit code 1