GIT_SILENT: add CMAKE_EXPORT_COMPILE_COMMANDS

2 jobs for master in 8 minutes and 9 seconds (queued for 473 minutes and 15 seconds)
Status Job ID Name Coverage
  Build
failed #89240
build_clazy_clang_tidy

00:04:09

passed #89239
linux kf5-qt5 qt5.15

00:04:00

90.0%
 
Name Stage Failure
failed
build_clazy_clang_tidy Build
make[2]: *** [src/CMakeFiles/KF5AkonadiNotes.dir/build.make:95: src/CMakeFiles/KF5AkonadiNotes.dir/noteutils.cpp.o] Error 254
make[1]: *** [CMakeFiles/Makefile2:192: src/CMakeFiles/KF5AkonadiNotes.dir/all] Error 2
make: *** [Makefile:160: all] Error 2
Uploading artifacts for failed job
Uploading artifacts...
WARNING: JUnitTestResults.xml: no matching files
ERROR: No files to upload
Cleaning up file based variables
ERROR: Job failed: exit code 1