GIT_SILENT: Prepare 5.16.2

1 job for v20.12.2 in 5 minutes and 55 seconds (queued for 138 minutes and 37 seconds)
latest
Status Job ID Name Coverage
  Build
failed #90394
build_clazy_clang_tidy

00:05:55

 
Name Stage Failure
failed
build_clazy_clang_tidy Build
make[2]: *** [src/CMakeFiles/KF5AkonadiNotes.dir/build.make:133: bin/libKF5AkonadiNotes.so.5.16.2] Error 1
make[1]: *** [CMakeFiles/Makefile2:192: src/CMakeFiles/KF5AkonadiNotes.dir/all] Error 2
make: *** [Makefile:160: all] Error 2
Uploading artifacts for failed job
Uploading artifacts...
WARNING: JUnitTestResults.xml: no matching files
ERROR: No files to upload
Cleaning up file based variables
ERROR: Job failed: exit code 1