Unset CC

2 jobs for !3 with ci/fix-clang-tidy in 13 minutes and 4 seconds
detached
Status Job ID Name Coverage
  Build
failed #48803
build_clazy_clang_tidy

00:04:51

passed #48802
linux kf5-qt5 qt5.12

00:13:04

1.0%
 
Name Stage Failure
failed
build_clazy_clang_tidy Build
make[2]: *** [src/private/protocolgen/CMakeFiles/protocolgen.dir/build.make:109: src/private/protocolgen/CMakeFiles/protocolgen.dir/cppgenerator.cpp.o] Error 1
make[1]: *** [CMakeFiles/Makefile2:2396: src/private/protocolgen/CMakeFiles/protocolgen.dir/all] Error 2
make: *** [Makefile:161: all] Error 2
Running after_script
Uploading artifacts for failed job
Uploading artifacts...
WARNING: JUnitTestResults.xml: no matching files
ERROR: No files to upload
ERROR: Job failed: exit code 1