Temporary Revert "GIT_SILENT: It compiles fine against kf5.72 without deprecated methods"

kparts is broken I provided a patch for it not accepted yet

This reverts commit b15f225a.
2 jobs for master in 8 minutes and 35 seconds (queued for 103 minutes and 30 seconds)
Status Job ID Name Coverage
  Build
failed #56045
build_clazy_clang_tidy

00:06:46

failed #56044
linux kf5-qt5 qt5.12

00:01:49

 
Name Stage Failure
failed
build_clazy_clang_tidy Build
make[2]: *** [kontactplugin/CMakeFiles/kontact_akregatorplugin_autogen.dir/build.make:82: kontactplugin/akregatorplugin.json] Error 127
make[1]: *** [CMakeFiles/Makefile2:1170: kontactplugin/CMakeFiles/kontact_akregatorplugin_autogen.dir/all] Error 2
[ 2%] Built target akregatorinterfaces_autogen
make: *** [Makefile:161: all] Error 2
Uploading artifacts for failed job
Uploading artifacts...
WARNING: JUnitTestResults.xml: no matching files
ERROR: No files to upload
ERROR: Job failed: exit code 1
failed
linux kf5-qt5 qt5.12 Build
    return self.do_open(http.client.HTTPSConnection, req,
File "/usr/lib64/python3.8/urllib/request.py", line 1353, in do_open
raise URLError(err)
urllib.error.URLError: <urlopen error [Errno -3] Temporary failure in name resolution>
Uploading artifacts for failed job
Uploading artifacts...
WARNING: JUnitTestResults.xml: no matching files
ERROR: No files to upload
ERROR: Job failed: exit code 1