Add parent to menu

1 job for release/21.08 in 3 minutes and 52 seconds (queued for 12 minutes and 6 seconds)
Status Name Job ID Coverage
failed build_clazy_clang_tidy #118328


Name Stage Failure
build_clazy_clang_tidy Build
make[2]: *** [kontactplugin/CMakeFiles/kontact_akregatorplugin.dir/build.make:141: bin/] Error 1
make[1]: *** [CMakeFiles/Makefile2:1149: kontactplugin/CMakeFiles/kontact_akregatorplugin.dir/all] Error 2
make: *** [Makefile:146: all] Error 2
Uploading artifacts for failed job
Uploading artifacts...
WARNING: JUnitTestResults.xml: no matching files
ERROR: No files to upload
Cleaning up file based variables
ERROR: Job failed: exit code 1