Use autorcc directly

2 jobs for master in 10 minutes and 4 seconds (queued for 89 minutes and 50 seconds)
Status Job ID Name Coverage
  Build
failed #89830
build_clazy_clang_tidy

00:05:03

passed #89829
linux kf5-qt5 qt5.15

00:05:00

0.0%
 
Name Stage Failure
failed
build_clazy_clang_tidy Build
make[2]: *** [grantleethemeeditor/CMakeFiles/grantleethemeeditor.dir/build.make:173: grantleethemeeditor/CMakeFiles/grantleethemeeditor.dir/desktopfilepage.cpp.o] Error 254
make[1]: *** [CMakeFiles/Makefile2:406: grantleethemeeditor/CMakeFiles/grantleethemeeditor.dir/all] Error 2
make: *** [Makefile:160: all] Error 2
Uploading artifacts for failed job
Uploading artifacts...
WARNING: JUnitTestResults.xml: no matching files
ERROR: No files to upload
Cleaning up file based variables
ERROR: Job failed: exit code 1