Revert "GIT_SILENT: It compiles fine against kf5.72 without deprecated methods"

kparts is broken I provided a patch for it not accepted yet
This reverts commit 9efa1760.
2 jobs for master in 6 minutes and 8 seconds (queued for 105 minutes and 50 seconds)
Status Job ID Name Coverage
  Build
failed #56047
build_clazy_clang_tidy

00:01:16

failed #56046
linux kf5-qt5 qt5.12

00:04:52

 
Name Stage Failure
failed
build_clazy_clang_tidy Build
Retrieving: clazy-1.7-1.1.x86_64.rpm [.done (452.1 KiB/s)]

Checking for file conflicts: [....done]
(1/1) Installing: clazy-1.7-1.1.x86_64 [............done]
Uploading artifacts for failed job
Uploading artifacts...
WARNING: JUnitTestResults.xml: no matching files
ERROR: No files to upload
ERROR: Job failed: exit code 1
failed
linux kf5-qt5 qt5.12 Build
make[2]: *** [kontactplugin/CMakeFiles/kontact_kaddressbookplugin_autogen.dir/build.make:82: kontactplugin/kaddressbookplugin.json] Error 127
make[1]: *** [CMakeFiles/Makefile2:568: kontactplugin/CMakeFiles/kontact_kaddressbookplugin_autogen.dir/all] Error 2
[ 4%] Built target kaddressbookprivate_autogen
make: *** [Makefile:161: all] Error 2
Uploading artifacts for failed job
Uploading artifacts...
WARNING: JUnitTestResults.xml: no matching files
ERROR: No files to upload
ERROR: Job failed: exit code 1