Use autorcc directly

2 jobs for master in 10 minutes and 5 seconds (queued for 28 minutes and 43 seconds)
Status Job ID Name Coverage
  Build
failed #89810
build_clazy_clang_tidy

00:04:57

passed #89809
linux kf5-qt5 qt5.15

00:05:07

0.0%
 
Name Stage Failure
failed
build_clazy_clang_tidy Build
make[2]: *** [src/importexport/CMakeFiles/KPimAddressbookImportExport.dir/build.make:121: src/importexport/CMakeFiles/KPimAddressbookImportExport.dir/contactselectiondialog.cpp.o] Error 254
make[1]: *** [CMakeFiles/Makefile2:565: src/importexport/CMakeFiles/KPimAddressbookImportExport.dir/all] Error 2
make: *** [Makefile:160: all] Error 2
Uploading artifacts for failed job
Uploading artifacts...
WARNING: JUnitTestResults.xml: no matching files
ERROR: No files to upload
Cleaning up file based variables
ERROR: Job failed: exit code 1