Add parent to qmenu

(cherry picked from commit 1e41e97f)
1 job for release/21.08 in 3 minutes and 38 seconds (queued for 17 minutes and 4 seconds)
Status Name Job ID Coverage
failed build_clazy_clang_tidy #118333


Name Stage Failure
build_clazy_clang_tidy Build
make[2]: *** [kontactplugin/CMakeFiles/kontact_kaddressbookplugin.dir/build.make:157: bin/] Error 1
make[1]: *** [CMakeFiles/Makefile2:595: kontactplugin/CMakeFiles/kontact_kaddressbookplugin.dir/all] Error 2
make: *** [Makefile:146: all] Error 2
Uploading artifacts for failed job
Uploading artifacts...
WARNING: JUnitTestResults.xml: no matching files
ERROR: No files to upload
Cleaning up file based variables
ERROR: Job failed: exit code 1