Now we can import address/name

CCBUG: 424940
2 jobs for master in 14 minutes and 7 seconds (queued for 2 seconds)
Status Job ID Name Coverage
  Build
failed #60959
build_clazy_clang_tidy

00:07:12

failed #60958
linux kf5-qt5 qt5.12

00:08:57

 
Name Stage Failure
failed
build_clazy_clang_tidy Build
clang-10.0: error: linker command failed with exit code 1 (use -v to see invocation)
make[2]: *** [plugins/messageviewerplugins/autotests/CMakeFiles/eventedittest.dir/build.make:195: bin/eventedittest] Error 1
make[1]: *** [CMakeFiles/Makefile2:4209: plugins/messageviewerplugins/autotests/CMakeFiles/eventedittest.dir/all] Error 2
make: *** [Makefile:161: all] Error 2
Uploading artifacts for failed job
Uploading artifacts...
WARNING: JUnitTestResults.xml: no matching files
ERROR: No files to upload
ERROR: Job failed: exit code 1
failed
linux kf5-qt5 qt5.12 Build
make[1]: *** [CMakeFiles/Makefile2:4236: plugins/messageviewerplugins/autotests/CMakeFiles/eventdatetimewidgettest.dir/all] Error 2
[ 11%] Linking CXX executable ../../../bin/viewerpluginmanagertest
[ 11%] Built target viewerpluginmanagertest
make: *** [Makefile:161: all] Error 2
Uploading artifacts for failed job
Uploading artifacts...
WARNING: JUnitTestResults.xml: no matching files
ERROR: No files to upload
ERROR: Job failed: exit code 1