Use same version as for messagelib

2 jobs for master in 23 minutes and 55 seconds (queued for 90 minutes and 35 seconds)
Status Job ID Name Coverage
  Build
failed #88112
build_clazy_clang_tidy

00:08:13

passed #88111
linux kf5-qt5 qt5.15

00:15:41

0.0%
 
Name Stage Failure
failed
build_clazy_clang_tidy Build
make[2]: *** [plugins/messageviewerplugins/autotests/CMakeFiles/noteedittest.dir/build.make:179: bin/noteedittest] Error 1
make[1]: *** [CMakeFiles/Makefile2:3988: plugins/messageviewerplugins/autotests/CMakeFiles/noteedittest.dir/all] Error 2
make: *** [Makefile:160: all] Error 2
Uploading artifacts for failed job
Uploading artifacts...
WARNING: JUnitTestResults.xml: no matching files
ERROR: No files to upload
Cleaning up file based variables
ERROR: Job failed: exit code 1