Avoid to close dialog when we press enter. + add placeHolder

2 jobs for master in 6 minutes and 38 seconds (queued for 56 minutes and 35 seconds)
Status Name Job ID Coverage
  Build
failed build_clazy_clang_tidy #105046

00:03:14

failed linux kf5-qt5 qt5.15 #105045

00:03:23

 
Name Stage Failure
failed
build_clazy_clang_tidy Build
make[2]: *** [plugins/messageviewerplugins/autotests/CMakeFiles/viewerplugincreatenotetest.dir/build.make:224: bin/viewerplugincreatenotetest] Error 1
make[1]: *** [CMakeFiles/Makefile2:4066: plugins/messageviewerplugins/autotests/CMakeFiles/viewerplugincreatenotetest.dir/all] Error 2
make: *** [Makefile:160: all] Error 2
Uploading artifacts for failed job
Uploading artifacts...
WARNING: JUnitTestResults.xml: no matching files
ERROR: No files to upload
Cleaning up file based variables
ERROR: Job failed: exit code 1
failed
linux kf5-qt5 qt5.15 Build
make[2]: *** [plugins/messageviewerplugins/autotests/CMakeFiles/viewerplugincreateeventtest.dir/build.make:239: bin/viewerplugincreateeventtest] Error 1
make[1]: *** [CMakeFiles/Makefile2:4201: plugins/messageviewerplugins/autotests/CMakeFiles/viewerplugincreateeventtest.dir/all] Error 2
make: *** [Makefile:160: all] Error 2
Uploading artifacts for failed job
Uploading artifacts...
WARNING: JUnitTestResults.xml: no matching files
ERROR: No files to upload
Cleaning up file based variables
ERROR: Job failed: exit code 1