Reduce kf5

2 jobs for master in 25 minutes and 18 seconds (queued for 1 second)
Status Job ID Name Coverage
  Build
failed #55168
build_clazy_clang_tidy

00:21:11

passed #55167
linux kf5-qt5 qt5.12

00:25:18

44.0%
 
Name Stage Failure
failed
build_clazy_clang_tidy Build
make[2]: *** [resources/imap/autotests/CMakeFiles/testretrieveitemstask.dir/build.make:166: bin/testretrieveitemstask] Error 1
make[1]: *** [CMakeFiles/Makefile2:3700: resources/imap/autotests/CMakeFiles/testretrieveitemstask.dir/all] Error 2
[ 90%] Built target akonadi_imap_resource
make: *** [Makefile:161: all] Error 2
Uploading artifacts for failed job
Uploading artifacts...
WARNING: JUnitTestResults.xml: no matching files
ERROR: No files to upload
ERROR: Job failed: exit code 1