GIT_SILENT: time to increase version

2 jobs for master in 59 minutes and 41 seconds (queued for 111 minutes and 8 seconds)
Status Job ID Name Coverage
  Build
failed #59155
build_clazy_clang_tidy

00:27:07

passed #59154
linux kf5-qt5 qt5.12

00:32:34

44.0%
 
Name Stage Failure
failed
build_clazy_clang_tidy Build
clang-10.0: error: linker command failed with exit code 1 (use -v to see invocation)
make[2]: *** [resources/imap/autotests/CMakeFiles/testresourcetask.dir/build.make:166: bin/testresourcetask] Error 1
make[1]: *** [CMakeFiles/Makefile2:3613: resources/imap/autotests/CMakeFiles/testresourcetask.dir/all] Error 2
make: *** [Makefile:161: all] Error 2
Uploading artifacts for failed job
Uploading artifacts...
WARNING: JUnitTestResults.xml: no matching files
ERROR: No files to upload
ERROR: Job failed: exit code 1