Setup widget first

1 job for release/20.08 in 24 minutes and 4 seconds (queued for 27 minutes and 30 seconds)
Status Job ID Name Coverage
failed #59448


Name Stage Failure
build_clazy_clang_tidy Build
clang-10.0: error: linker command failed with exit code 1 (use -v to see invocation)
make[2]: *** [resources/imap/autotests/CMakeFiles/testaddcollectiontask.dir/build.make:166: bin/testaddcollectiontask] Error 1
make[1]: *** [CMakeFiles/Makefile2:3642: resources/imap/autotests/CMakeFiles/testaddcollectiontask.dir/all] Error 2
make: *** [Makefile:161: all] Error 2
Uploading artifacts for failed job
Uploading artifacts...
WARNING: JUnitTestResults.xml: no matching files
ERROR: No files to upload
ERROR: Job failed: exit code 1