const'ify

2 jobs for master in 31 minutes and 20 seconds
Status Job ID Name Coverage
  Build
failed #59702
build_clazy_clang_tidy

00:26:08

passed #59701
linux kf5-qt5 qt5.12

00:31:20

44.0%
 
Name Stage Failure
failed
build_clazy_clang_tidy Build
make[2]: *** [resources/imap/autotests/CMakeFiles/testadditemtask.dir/build.make:166: bin/testadditemtask] Error 1
make[1]: *** [CMakeFiles/Makefile2:3729: resources/imap/autotests/CMakeFiles/testadditemtask.dir/all] Error 2
[ 94%] Built target akonadi_imap_resource
make: *** [Makefile:161: all] Error 2
Uploading artifacts for failed job
Uploading artifacts...
WARNING: JUnitTestResults.xml: no matching files
ERROR: No files to upload
ERROR: Job failed: exit code 1