GIT_SILENT: It compiles fine without deprecated method

2 jobs for master in 67 minutes and 41 seconds (queued for 133 minutes and 29 seconds)
Status Name Job ID Coverage
  Build
failed build_clazy_clang_tidy #63514

00:35:55

passed linux kf5-qt5 qt5.12 #63513

00:31:45

42.0%
 
Name Stage Failure
failed
build_clazy_clang_tidy Build
clang-10.0: error: linker command failed with exit code 1 (use -v to see invocation)
make[2]: *** [resources/imap/autotests/CMakeFiles/testretrieveitemstask.dir/build.make:165: bin/testretrieveitemstask] Error 1
make[1]: *** [CMakeFiles/Makefile2:3699: resources/imap/autotests/CMakeFiles/testretrieveitemstask.dir/all] Error 2
make: *** [Makefile:160: all] Error 2
Uploading artifacts for failed job
Uploading artifacts...
WARNING: JUnitTestResults.xml: no matching files
ERROR: No files to upload
ERROR: Job failed: exit code 1