Relicense LGPL-2.0-only files to LGPL-2.0-or-later

2 jobs for master in 27 minutes and 9 seconds (queued for 16 minutes and 8 seconds)
Status Name Job ID Coverage
  Build
failed build_clazy_clang_tidy #66668

00:20:14

failed linux kf5-qt5 qt5.12 #66667

00:06:54

 
Name Stage Failure
failed
build_clazy_clang_tidy Build
make[2]: *** [resources/imap/autotests/CMakeFiles/testaddcollectiontask.dir/build.make:165: bin/testaddcollectiontask] Error 1
make[1]: *** [CMakeFiles/Makefile2:3641: resources/imap/autotests/CMakeFiles/testaddcollectiontask.dir/all] Error 2
[ 89%] Built target akonadi_ews_resource
make: *** [Makefile:160: all] Error 2
Uploading artifacts for failed job
Uploading artifacts...
WARNING: JUnitTestResults.xml: no matching files
ERROR: No files to upload
ERROR: Job failed: exit code 1
failed
linux kf5-qt5 qt5.12 Build
    return self.do_open(http.client.HTTPSConnection, req,
File "/usr/lib64/python3.8/urllib/request.py", line 1353, in do_open
raise URLError(err)
urllib.error.URLError: <urlopen error [Errno -3] Temporary failure in name resolution>
Uploading artifacts for failed job
Uploading artifacts...
WARNING: JUnitTestResults.xml: no matching files
ERROR: No files to upload
ERROR: Job failed: exit code 1