Clean up code

2 jobs for master in 8 minutes and 54 seconds (queued for 1 second)
Status Job ID Name Coverage
  Build
failed #51747
build_clazy_clang_tidy

00:08:54

failed #51746
linux kf5-qt5 qt5.12

00:08:07

 
Name Stage Failure
failed
build_clazy_clang_tidy Build
17 warnings generated.
make[1]: *** [CMakeFiles/Makefile2:1164: src/CMakeFiles/kmailprivate.dir/all] Error 2
make: *** [Makefile:161: all] Error 2
Running after_script
Uploading artifacts for failed job
Uploading artifacts...
WARNING: JUnitTestResults.xml: no matching files
ERROR: No files to upload
ERROR: Job failed: exit code 1
failed
linux kf5-qt5 qt5.12 Build
make[2]: *** [agents/mailfilteragent/CMakeFiles/akonadi_mailfilter_agent.dir/build.make:222: bin/akonadi_mailfilter_agent] Error 1
make[1]: *** [CMakeFiles/Makefile2:3658: agents/mailfilteragent/CMakeFiles/akonadi_mailfilter_agent.dir/all] Error 2
make: *** [Makefile:161: all] Error 2
Running after_script
Uploading artifacts for failed job
Uploading artifacts...
WARNING: JUnitTestResults.xml: no matching files
ERROR: No files to upload
ERROR: Job failed: exit code 1