Add missing remove text

1 job for release/20.08 in 8 minutes and 18 seconds (queued for 14 seconds)
Status Job ID Name Coverage
  Build
failed #73267
build_clazy_clang_tidy

00:08:18

 
Name Stage Failure
failed
build_clazy_clang_tidy Build
1 error generated.
make[2]: *** [src/CMakeFiles/kmailprivate.dir/build.make:374: src/CMakeFiles/kmailprivate.dir/kmcommands.cpp.o] Error 1
make[1]: *** [CMakeFiles/Makefile2:1163: src/CMakeFiles/kmailprivate.dir/all] Error 2
make: *** [Makefile:160: all] Error 2
Uploading artifacts for failed job
Uploading artifacts...
WARNING: JUnitTestResults.xml: no matching files
ERROR: No files to upload
ERROR: Job failed: exit code 1