GIT_SILENT made messages (after extraction)

1 job for v20.07.90 in 6 minutes and 18 seconds (queued for 68 minutes and 16 seconds)
latest
Status Job ID Name Coverage
  Build
failed #60011
build_clazy_clang_tidy

00:06:18

 
Name Stage Failure
failed
build_clazy_clang_tidy Build
1 error generated.
make[2]: *** [src/CMakeFiles/kcm_kontact.dir/build.make:83: src/CMakeFiles/kcm_kontact.dir/kcm_kontact_autogen/mocs_compilation.cpp.o] Error 1
make[1]: *** [CMakeFiles/Makefile2:279: src/CMakeFiles/kcm_kontact.dir/all] Error 2
make: *** [Makefile:161: all] Error 2
Uploading artifacts for failed job
Uploading artifacts...
WARNING: JUnitTestResults.xml: no matching files
ERROR: No files to upload
ERROR: Job failed: exit code 1