GIT_SILENT: prepare 5.15.0

1 job for release/20.08 in 7 minutes and 28 seconds (queued for 132 minutes and 2 seconds)
Status Job ID Name Coverage
  Build
failed #60574
build_clazy_clang_tidy

00:07:28

 
Name Stage Failure
failed
build_clazy_clang_tidy Build
1 error generated.
make[2]: *** [src/CMakeFiles/kcm_kontact.dir/build.make:96: src/CMakeFiles/kcm_kontact.dir/kcmkontact.cpp.o] Error 1
make[1]: *** [CMakeFiles/Makefile2:279: src/CMakeFiles/kcm_kontact.dir/all] Error 2
make: *** [Makefile:161: all] Error 2
Uploading artifacts for failed job
Uploading artifacts...
WARNING: JUnitTestResults.xml: no matching files
ERROR: No files to upload
ERROR: Job failed: exit code 1