GIT_SILENT Update Appstream for new release

1 job for v20.08.0 in 6 minutes and 58 seconds (queued for 89 minutes and 34 seconds)
latest
Status Job ID Name Coverage
  Build
failed #62168
build_clazy_clang_tidy

00:06:58

 
Name Stage Failure
failed
build_clazy_clang_tidy Build
1 error generated.
make[2]: *** [src/CMakeFiles/kcm_kontact.dir/build.make:82: src/CMakeFiles/kcm_kontact.dir/kcm_kontact_autogen/mocs_compilation.cpp.o] Error 1
make[1]: *** [CMakeFiles/Makefile2:278: src/CMakeFiles/kcm_kontact.dir/all] Error 2
make: *** [Makefile:160: all] Error 2
Uploading artifacts for failed job
Uploading artifacts...
WARNING: JUnitTestResults.xml: no matching files
ERROR: No files to upload
ERROR: Job failed: exit code 1