Fix header here too

2 jobs for master in 7 minutes and 29 seconds (queued for 5 minutes and 8 seconds)
Status Job ID Name Coverage
  Build
failed #50993
build_clazy_clang_tidy

00:07:09

failed #50992
linux kf5-qt5 qt5.12

00:06:07

 
Name Stage Failure
failed
build_clazy_clang_tidy Build
make[2]: *** Waiting for unfinished jobs....
make[1]: *** [CMakeFiles/Makefile2:953: src/libkdepimakonadi/CMakeFiles/KF5LibkdepimAkonadi.dir/all] Error 2
make: *** [Makefile:161: all] Error 2
Running after_script
Uploading artifacts for failed job
Uploading artifacts...
WARNING: JUnitTestResults.xml: no matching files
ERROR: No files to upload
ERROR: Job failed: exit code 1
failed
linux kf5-qt5 qt5.12 Build
make[2]: *** [src/libkdepimakonadi/CMakeFiles/KF5LibkdepimAkonadi.dir/build.make:213: src/libkdepimakonadi/CMakeFiles/KF5LibkdepimAkonadi.dir/addressline/addresslineedit/addresseelineeditldap.cpp.o] Error 1
make[1]: *** [CMakeFiles/Makefile2:953: src/libkdepimakonadi/CMakeFiles/KF5LibkdepimAkonadi.dir/all] Error 2
make: *** [Makefile:161: all] Error 2
Running after_script
Uploading artifacts for failed job
Uploading artifacts...
WARNING: JUnitTestResults.xml: no matching files
ERROR: No files to upload
ERROR: Job failed: exit code 1