Only search for KF5AkonadiContact once

1 job for release/20.08 in 27 minutes and 39 seconds (queued for 39 minutes and 38 seconds)
Status Job ID Name Coverage
  Build
failed #59258
build_clazy_clang_tidy

00:27:39

 
Name Stage Failure
failed
build_clazy_clang_tidy Build
1 error generated.
make[2]: *** [messagecomposer/src/CMakeFiles/KF5MessageComposer.dir/build.make:811: messagecomposer/src/CMakeFiles/KF5MessageComposer.dir/composer/composerviewbase.cpp.o] Error 1
make[1]: *** [CMakeFiles/Makefile2:6923: messagecomposer/src/CMakeFiles/KF5MessageComposer.dir/all] Error 2
make: *** [Makefile:161: all] Error 2
Uploading artifacts for failed job
Uploading artifacts...
WARNING: JUnitTestResults.xml: no matching files
ERROR: No files to upload
ERROR: Job failed: exit code 1