Merge remote-tracking branch 'origin/release/20.12'

2 jobs for master in 22 minutes and 21 seconds (queued for 5 minutes and 10 seconds)
Status Name Job ID Coverage
  Build
failed build_clazy_clang_tidy #90144

00:05:03

passed linux kf5-qt5 qt5.15 #90143

00:17:18

37.0%
 
Name Stage Failure
failed
build_clazy_clang_tidy Build
make[2]: *** [messagecore/src/CMakeFiles/KF5MessageCore.dir/build.make:125: messagecore/src/CMakeFiles/KF5MessageCore.dir/attachment/attachmentfromfolderjob.cpp.o] Error 254
make[1]: *** [CMakeFiles/Makefile2:9426: messagecore/src/CMakeFiles/KF5MessageCore.dir/all] Error 2
make: *** [Makefile:160: all] Error 2
Uploading artifacts for failed job
Uploading artifacts...
WARNING: JUnitTestResults.xml: no matching files
ERROR: No files to upload
Cleaning up file based variables
ERROR: Job failed: exit code 1