Update appstream data

1 job for release/21.05 in 36 minutes and 9 seconds (queued for 119 minutes and 54 seconds)
latest
Status Name Job ID Coverage
  Build
failed android #106202

00:36:09

 
Name Stage Failure
failed
android Build
    ^
[ 82%] Building CXX object src/CMakeFiles/kweather.dir/locationquerymodel.cpp.o
1 error generated.
make[2]: *** [src/CMakeFiles/kweather.dir/build.make:189: src/CMakeFiles/kweather.dir/weatherlocation.cpp.o] Error 1
make[2]: *** Waiting for unfinished jobs....
make[1]: *** [CMakeFiles/Makefile2:367: src/CMakeFiles/kweather.dir/all] Error 2
make: *** [Makefile:160: all] Error 2
Cleaning up file based variables
ERROR: Job failed: exit code 1