{
    "consumer_runtime_records": [
        {
            "consumer_id": "test_app1",
            "consumer_version": "1.2.3",
            "start_time": "2024-10-21T13:04:35.873Z",
            "stop_time": "2024-10-21T13:04:55.936Z"
        },
        {
            "consumer_id": "test_app1",
            "consumer_version": "4.5.6",
            "start_time": "2024-10-21T13:05:45.077Z",
            "stop_time": "2024-10-21T13:05:46.259Z"
        }
    ]
}
