<?xml version="1.0" encoding="UTF-8" standalone="no"?>
<svg
   xmlns:dc="http://purl.org/dc/elements/1.1/"
   xmlns:cc="http://creativecommons.org/ns#"
   xmlns:rdf="http://www.w3.org/1999/02/22-rdf-syntax-ns#"
   xmlns:svg="http://www.w3.org/2000/svg"
   xmlns="http://www.w3.org/2000/svg"
   xmlns:sodipodi="http://sodipodi.sourceforge.net/DTD/sodipodi-0.dtd"
   xmlns:inkscape="http://www.inkscape.org/namespaces/inkscape"
   id="Layer_21"
   data-name="Layer 21"
   viewBox="0 0 28 25"
   version="1.1"
   sodipodi:docname="settingsmenu_launcher_icon.svg"
   width="28"
   height="25"
   inkscape:version="0.92.1 r15371">
  <metadata
     id="metadata4504">
    <rdf:RDF>
      <cc:Work
         rdf:about="">
        <dc:format>image/svg+xml</dc:format>
        <dc:type
           rdf:resource="http://purl.org/dc/dcmitype/StillImage" />
      </cc:Work>
    </rdf:RDF>
  </metadata>
  <defs
     id="defs4502" />
  <sodipodi:namedview
     pagecolor="#ffffff"
     bordercolor="#666666"
     borderopacity="1"
     objecttolerance="10"
     gridtolerance="10"
     guidetolerance="10"
     inkscape:pageopacity="0"
     inkscape:pageshadow="2"
     inkscape:window-width="1349"
     inkscape:window-height="913"
     id="namedview4500"
     showgrid="false"
     inkscape:zoom="11"
     inkscape:cx="14.044687"
     inkscape:cy="12.137757"
     inkscape:window-x="189"
     inkscape:window-y="90"
     inkscape:window-maximized="0"
     inkscape:current-layer="Layer_21" />
  <title
     id="title4485">settingsmenu_launcher</title>
  <rect
     x="0"
     y="0"
     width="28"
     height="6"
     style="fill:#9ca0aa;fill-opacity:1"
     id="rect4487" />
  <rect
     x="0"
     y="10"
     width="28"
     height="6"
     style="fill:#9ca0aa;fill-opacity:1"
     id="rect4489" />
  <rect
     x="0"
     y="20"
     width="28"
     height="5"
     style="fill:#9ca0aa;fill-opacity:1"
     id="rect4491" />
  <rect
     x="0"
     y="0"
     width="28"
     height="6"
     style="fill:#9ca0aa;fill-opacity:1"
     id="rect4493" />
  <rect
     x="0"
     y="10"
     width="28"
     height="6"
     style="fill:#9ca0aa;fill-opacity:1"
     id="rect4495" />
  <rect
     x="0"
     y="20"
     width="28"
     height="5"
     style="fill:#9ca0aa;fill-opacity:1"
     id="rect4497" />
</svg>
