<?xml version="1.0" encoding="UTF-8" standalone="no"?>
<svg
   xmlns:dc="http://purl.org/dc/elements/1.1/"
   xmlns:cc="http://creativecommons.org/ns#"
   xmlns:rdf="http://www.w3.org/1999/02/22-rdf-syntax-ns#"
   xmlns:svg="http://www.w3.org/2000/svg"
   xmlns="http://www.w3.org/2000/svg"
   xmlns:sodipodi="http://sodipodi.sourceforge.net/DTD/sodipodi-0.dtd"
   xmlns:inkscape="http://www.inkscape.org/namespaces/inkscape"
   id="touch"
   viewBox="0 0 27.831027 27.886194"
   version="1.1"
   sodipodi:docname="touch_icon.svg"
   width="27.831026"
   height="27.886194"
   inkscape:version="0.92.1 r15371">
  <metadata
     id="metadata3701">
    <rdf:RDF>
      <cc:Work
         rdf:about="">
        <dc:format>image/svg+xml</dc:format>
        <dc:type
           rdf:resource="http://purl.org/dc/dcmitype/StillImage" />
        <dc:title>touch_icon</dc:title>
      </cc:Work>
    </rdf:RDF>
  </metadata>
  <defs
     id="defs3699" />
  <sodipodi:namedview
     pagecolor="#ffffff"
     bordercolor="#666666"
     borderopacity="1"
     objecttolerance="10"
     gridtolerance="10"
     guidetolerance="10"
     inkscape:pageopacity="0"
     inkscape:pageshadow="2"
     inkscape:window-width="959"
     inkscape:window-height="885"
     id="namedview3697"
     showgrid="false"
     inkscape:pagecheckerboard="true"
     inkscape:zoom="11"
     inkscape:cx="-2.7170763"
     inkscape:cy="5.8448805"
     inkscape:window-x="392"
     inkscape:window-y="160"
     inkscape:window-maximized="0"
     inkscape:current-layer="touch"
     fit-margin-left="2.2"
     fit-margin-right="2.2"
     fit-margin-top="0"
     fit-margin-bottom="0" />
  <title
     id="title3680">touch_icon</title>
  <path
     d="m 2.5109339,19.115261 a 1.06,1.06 0 0 1 0,-1.5 l 4.23,-4.25 a 1.06,1.06 0 0 1 1.5,0 l 8.4800001,8.46 v 0 a 1.06,1.06 0 0 1 0,1.5 l -4.24,4.25 a 1.06,1.06 0 0 1 -1.5,0 l -8.4700001,-8.45 z m 5,-3.5 -2.74,2.74 7.0000001,7 2.73,-2.74 -7.0000001,-7 z"
     style="fill:#ffffff"
     id="path3682"
     inkscape:connector-curvature="0" />
  <path
     d="m 21.700934,2.3652608 a 1,1 0 0 1 0,1.36 l -4.41,4.41 a 3.68,3.68 0 0 1 0.77,0.48 l 0.44,-0.44 a 1,1 0 0 1 1.37,1.35 l -0.42,0.42 0.62,0.6200002 0.23,-0.23 a 1,1 0 1 1 1.36,1.36 l -0.25,0.25 a 3.68,3.68 0 0 1 0.48,0.76 1,1 0 0 1 1.36,1.36 l -1.74,1.74 -1.23,1.23 -3.23,3.23 a 2.38,2.38 0 0 1 -1.39,0.66 l -6.5900001,-6.55 a 2.52,2.52 0 0 1 0.22,-0.76 L 10.660934,8.6152608 a 1,1 0 0 1 0.26,-0.44 l 3.05,-3.05 a 0.91,0.91 0 1 1 1.3,1.27 l -1.25,1.24 -0.22,1.25 6.54,-6.54 a 1,1 0 0 1 1.36,0 m 1.5,-1.46000001 a 3.09,3.09 0 0 0 -4.33,0 l -2.4,2.40000001 a 3.08,3.08 0 0 0 -4,0.34 l -3.0500001,3.03 a 3.13,3.13 0 0 0 -0.81,1.39 l -1.32,4.8400002 a 4.74,4.74 0 0 0 -0.32,1.19 2.12,2.12 0 0 0 0.6,1.81 v 0 l 6.5700001,6.56 a 2.11,2.11 0 0 0 1.78,0.6 4.49,4.49 0 0 0 2.61,-1.27 l 3.23,-3.23 1.23,-1.23 1.74,-1.74 a 3.09,3.09 0 0 0 0,-4.36 3,3 0 0 0 -0.7,-0.52 3.08,3.08 0 0 0 -1.85,-2.5100002 3.09,3.09 0 0 0 -0.63,-1.3 l 1.65,-1.65 a 3.09,3.09 0 0 0 0,-4.36000001 z"
     style="fill:#ffffff"
     id="path3684"
     inkscape:connector-curvature="0" />
</svg>
