{
    "Analysis": {
        "EnableDisable": {
            "_active": true
        },
        "EnableDisableSingleRule": {
            "_active": true
        },
        "InitialExternalAnnotations": {
            "_active": true,
            "initial_comments": {
                "$(delta:+)": {
                    "*/rep_*": [
                        "AXIVION Disable"
                    ],
                    "*/qifqueryparser_flex*": [
                        "AXIVION Disable"
                    ],
                    "build/include/*/*": [
                        "AXIVION Disable"
                    ],
                    "build/*/*-config*.h": [
                        "AXIVION Disable"
                    ],
                    "build/*/*_qmltyperegistrations.cpp": [
                        "AXIVION Disable"
                    ]
                },
                "$(delta:-)": []
            }
        },
        "ReportUnclosedRestOfFileComments": {
            "_active": true,
            "excludes": ["*/rep_*", "*/qifqueryparser_flex*", "build/include/*/*", "build/*/*-config*.h", "build/*/*_qmltyperegistrations.cpp"]
        },
        "NextLine": {
            "_active": true
        },
        "PreviousLine": {
            "_active": true
        },
        "SameLine": {
            "_active": true
        }
    },
    "Project": {
        "BuildSystemIntegration": {
            "child_order": [
                "GCCSetup",
                "CMake",
                "LinkLibraries"
            ]
        },
        "CMake": {
            "_active": true,
            "_copy_from": "CMakeIntegration",
            "build_environment": {},
            "build_options": "-j4",
            "generate_options": "--fresh",
            "generator": "Ninja"
        },
        "GCCSetup": {
            "_active": true,
            "_copy_from": "Command",
            "build_command": "gccsetup --cc gcc --cxx g++ --config ../../../axivion/"
        },
        "LinkLibraries": {
            "_active": true,
            "_copy_from": "AxivionLinker",
            "input_files": [
                "build/lib/lib*.so*.ir"
            ],
            "ir": "build/$(env:TESTED_MODULE_COIN).ir",
            "plugin_files": [
            ],
            "options": "--include_unused"
        }
    },
    "_Format": "1.0",
    "_Version": "7.6.2",
    "_VersionNum": [
        7,
        6,
        2,
        12725
    ]
}
