iteration 1;2024-09-13 17:30:23;startTestrun
iteration 1;2024-09-13 17:34:02;stopTestrun
iteration 2;2024-09-13 17:35:32;startTestrun
iteration 2;2024-09-13 17:39:11;stopTestrun
iteration 3;2024-09-13 17:40:41;startTestrun
iteration 3;2024-09-13 17:44:20;stopTestrun
iteration 4;2024-09-13 17:45:50;startTestrun
iteration 4;2024-09-13 17:49:29;stopTestrun
iteration 5;2024-09-13 17:50:59;startTestrun
iteration 5;2024-09-13 17:54:38;stopTestrun
iteration 6;2024-09-13 17:56:08;startTestrun
iteration 6;2024-09-13 17:59:47;stopTestrun
iteration 7;2024-09-13 18:01:17;startTestrun
iteration 7;2024-09-13 18:04:56;stopTestrun
iteration 8;2024-09-13 18:06:26;startTestrun
iteration 8;2024-09-13 18:10:05;stopTestrun
iteration 9;2024-09-13 18:11:35;startTestrun
iteration 9;2024-09-13 18:15:14;stopTestrun
iteration 10;2024-09-13 18:16:44;startTestrun
iteration 10;2024-09-13 18:20:23;stopTestrun
