iteration 1;2024-09-13 18:21:55;startTestrun
iteration 1;2024-09-13 18:22:00;startAction;open okular 
iteration 1;2024-09-13 18:22:02;stopAction 
iteration 1;2024-09-13 18:25:32;startAction;quit okular 
iteration 1;2024-09-13 18:25:34;stopAction 
iteration 1;2024-09-13 18:25:34;stopTestrun
iteration 2;2024-09-13 18:27:05;startTestrun
iteration 2;2024-09-13 18:27:10;startAction;open okular 
iteration 2;2024-09-13 18:27:12;stopAction 
iteration 2;2024-09-13 18:30:42;startAction;quit okular 
iteration 2;2024-09-13 18:30:44;stopAction 
iteration 2;2024-09-13 18:30:44;stopTestrun
iteration 3;2024-09-13 18:32:15;startTestrun
iteration 3;2024-09-13 18:32:20;startAction;open okular 
iteration 3;2024-09-13 18:32:22;stopAction 
iteration 3;2024-09-13 18:35:52;startAction;quit okular 
iteration 3;2024-09-13 18:35:54;stopAction 
iteration 3;2024-09-13 18:35:54;stopTestrun
iteration 4;2024-09-13 18:37:25;startTestrun
iteration 4;2024-09-13 18:37:30;startAction;open okular 
iteration 4;2024-09-13 18:37:32;stopAction 
iteration 4;2024-09-13 18:41:02;startAction;quit okular 
iteration 4;2024-09-13 18:41:04;stopAction 
iteration 4;2024-09-13 18:41:04;stopTestrun
iteration 5;2024-09-13 18:42:35;startTestrun
iteration 5;2024-09-13 18:42:40;startAction;open okular 
iteration 5;2024-09-13 18:42:42;stopAction 
iteration 5;2024-09-13 18:46:12;startAction;quit okular 
iteration 5;2024-09-13 18:46:14;stopAction 
iteration 5;2024-09-13 18:46:14;stopTestrun
iteration 6;2024-09-13 18:47:45;startTestrun
iteration 6;2024-09-13 18:47:50;startAction;open okular 
iteration 6;2024-09-13 18:47:52;stopAction 
iteration 6;2024-09-13 18:51:22;startAction;quit okular 
iteration 6;2024-09-13 18:51:24;stopAction 
iteration 6;2024-09-13 18:51:24;stopTestrun
iteration 7;2024-09-13 18:52:55;startTestrun
iteration 7;2024-09-13 18:53:00;startAction;open okular 
iteration 7;2024-09-13 18:53:02;stopAction 
iteration 7;2024-09-13 18:56:32;startAction;quit okular 
iteration 7;2024-09-13 18:56:34;stopAction 
iteration 7;2024-09-13 18:56:34;stopTestrun
iteration 8;2024-09-13 18:58:05;startTestrun
iteration 8;2024-09-13 18:58:10;startAction;open okular 
iteration 8;2024-09-13 18:58:12;stopAction 
iteration 8;2024-09-13 19:01:42;startAction;quit okular 
iteration 8;2024-09-13 19:01:44;stopAction 
iteration 8;2024-09-13 19:01:44;stopTestrun
iteration 9;2024-09-13 19:03:15;startTestrun
iteration 9;2024-09-13 19:03:20;startAction;open okular 
iteration 9;2024-09-13 19:03:22;stopAction 
iteration 9;2024-09-13 19:06:52;startAction;quit okular 
iteration 9;2024-09-13 19:06:54;stopAction 
iteration 9;2024-09-13 19:06:54;stopTestrun
iteration 10;2024-09-13 19:08:25;startTestrun
iteration 10;2024-09-13 19:08:30;startAction;open okular 
iteration 10;2024-09-13 19:08:32;stopAction 
iteration 10;2024-09-13 19:12:02;startAction;quit okular 
iteration 10;2024-09-13 19:12:04;stopAction 
iteration 10;2024-09-13 19:12:04;stopTestrun
