<?xml version="1.0" encoding="utf-8"?>
<!-- Generator: Adobe Illustrator 25.3.0, SVG Export Plug-In . SVG Version: 6.00 Build 0)  -->
<svg version="1.1" xmlns="http://www.w3.org/2000/svg" xmlns:xlink="http://www.w3.org/1999/xlink" x="0px" y="0px"
	 viewBox="0 0 1948 848" style="enable-background:new 0 0 1948 848;" xml:space="preserve">
<style type="text/css">
	.st0{display:none;}
	.st1{display:inline;}
	.st2{display:inline;fill:#FFFFFF;}
	.st3{display:inline;fill:#54A3D8;}
	.st4{fill:#AFCA0B;}
	.st5{fill:#FAFCF8;}
	.st6{display:inline;opacity:0.54;}
	.st7{opacity:0.54;}
	.st8{display:inline;fill:none;stroke:#54A3D8;stroke-width:2;stroke-miterlimit:10;}
	.st9{display:inline;opacity:0.79;fill:#FFFFFF;}
	.st10{fill:#FFFFFF;}
	.st11{fill:#54A3D8;}
	.st12{fill:none;stroke:#54A3D8;stroke-width:2;stroke-miterlimit:10;}
	.st13{opacity:0.79;fill:#FFFFFF;}
	.st14{fill:#1D99F3;}
	.st15{fill:#9FDB4B;}
	.st16{fill:#8BCF2D;}
	.st17{fill:#7BCF06;}
	.st18{fill:#62EF7A;}
	.st19{fill:#16DB93;}
	.st20{fill:#3DC230;}
	.st21{fill:#229418;}
</style>
<g id="kde-org" class="st0">
</g>
<g id="kde-eco" class="st0">
</g>
<g id="kde-feep">
	<g>
		<g>
			<path class="st14" d="M754.37,353.7c-9.16-10.6-21.36-19.18-36.27-25.48c-14.81-6.27-32.89-9.44-53.75-9.44H598.9v211.86h75.31
				c14.24,0,27.91-2.36,40.65-7.02c12.8-4.68,24.25-11.57,34.02-20.47c9.79-8.93,17.62-19.82,23.27-32.37
				c5.66-12.58,8.54-26.88,8.54-42.51c0-13.06-2.11-26.21-6.27-39.09C770.19,376.15,763.45,364.22,754.37,353.7z M729.05,425.53
				c0,9.27-1.48,17.56-4.39,24.64c-2.85,6.93-6.97,12.75-12.23,17.28c-5.36,4.62-11.87,8.18-19.36,10.59
				c-7.64,2.46-16.29,3.71-25.72,3.71h-18.21V367.4h26.96c4.08,0,9.23,0.82,15.32,2.42c5.89,1.56,11.79,4.45,17.52,8.6
				c5.58,4.04,10.38,9.9,14.26,17.41C727.09,403.34,729.05,413.34,729.05,425.53z"/>
			<polygon class="st14" points="867.09,481.75 867.09,448.88 953.5,448.88 953.5,399.99 867.09,399.99 867.09,367.67 
				964.71,367.67 964.71,318.78 816.83,318.78 816.83,530.64 968.54,530.64 968.54,481.75 			"/>
		</g>
		<path class="st16" d="M1111.42,530.58c-24.15,0-44.59-4.53-61.34-13.58s-29.5-21.57-38.25-37.58
			c-8.76-15.99-13.13-34.41-13.13-55.23c0-19.92,5.13-37.87,15.39-53.87c10.26-15.99,24-28.75,41.2-38.25
			c17.2-9.51,36.36-14.26,57.49-14.26c28.37,0,51.68,8.23,69.94,24.67c18.26,16.45,30.11,40.22,35.54,71.3l-153.92,48.89
			l-14.03-34.41l111.37-37.57l-13.13,5.88c-2.42-7.84-6.72-14.71-12.91-20.6c-6.19-5.89-15.47-8.83-27.84-8.83
			c-9.36,0-17.59,2.19-24.67,6.56c-7.1,4.38-12.53,10.57-16.3,18.56c-3.78,8-5.66,17.43-5.66,28.29c0,12.38,2.27,22.71,6.79,31.01
			c4.53,8.3,10.71,14.56,18.56,18.79c7.84,4.23,16.59,6.34,26.26,6.34c6.94,0,13.65-1.2,20.15-3.62c6.48-2.41,12.9-5.58,19.24-9.51
			l28.07,47.08c-10.57,6.04-21.96,10.87-34.18,14.49C1133.82,528.77,1122.28,530.58,1111.42,530.58z"/>
		<path class="st16" d="M1425.07,507.49c-8.76,6.95-19.7,12.53-32.83,16.75c-13.13,4.22-26.03,6.34-38.71,6.34
			c-22.63,0-42.32-4.15-59.08-12.45c-16.75-8.3-29.73-20.21-38.94-35.76c-9.21-15.54-13.8-34.33-13.8-56.36
			c0-22.03,4.98-40.81,14.94-56.36c9.96-15.54,23.01-27.39,39.16-35.54c16.14-8.15,33.12-12.23,50.93-12.23
			c17.8,0,33.27,2.42,46.4,7.25c13.13,4.83,24.36,11.17,33.72,19.01l-30.78,40.74c-4.23-3.32-10.04-6.71-17.43-10.19
			c-7.4-3.47-16.07-5.21-26.03-5.21c-8.76,0-16.75,2.27-24,6.79c-7.24,4.53-12.97,10.72-17.2,18.56c-4.23,7.85-6.34,16.9-6.34,27.16
			c0,9.66,2.26,18.56,6.79,26.71c4.53,8.15,10.78,14.56,18.78,19.24c7.99,4.68,17.43,7.02,28.29,7.02c6.94,0,13.36-0.97,19.24-2.94
			c5.88-1.96,10.94-4.75,15.17-8.38L1425.07,507.49z"/>
		<path class="st16" d="M1451.24,423.74c0-20.22,4.75-38.32,14.26-54.33c9.51-15.99,22.86-28.59,40.07-37.8
			c17.21-9.2,36.96-13.81,59.3-13.81c22.64,0,42.25,4.61,58.85,13.81c16.6,9.21,29.35,21.81,38.25,37.8
			c8.9,16,13.36,34.11,13.36,54.33c0,20.22-4.46,38.41-13.36,54.55c-8.9,16.15-21.66,28.9-38.25,38.25
			c-16.6,9.35-36.52,14.03-59.76,14.03c-21.73,0-41.13-4.23-58.17-12.67c-17.06-8.45-30.41-20.67-40.07-36.67
			C1456.06,465.24,1451.24,446.08,1451.24,423.74z M1515.07,424.2c0,10.26,2.11,19.54,6.34,27.84c4.22,8.3,9.96,14.87,17.2,19.69
			c7.25,4.83,15.39,7.24,24.44,7.24c9.96,0,18.56-2.41,25.81-7.24c7.25-4.82,12.83-11.39,16.75-19.69
			c3.92-8.3,5.88-17.58,5.88-27.84c0-10.56-1.96-19.92-5.88-28.07c-3.92-8.15-9.51-14.64-16.75-19.47
			c-7.25-4.82-15.85-7.24-25.81-7.24c-9.05,0-17.2,2.42-24.44,7.24c-7.24,4.83-12.98,11.32-17.2,19.47
			C1517.18,404.28,1515.07,413.63,1515.07,424.2z"/>
		<polygon class="st14" points="365.97,225.45 272.67,234.38 272.67,618.57 364.98,604.68 364.98,440.87 489.07,622.55 
			586.36,591.77 459.29,417.05 587.35,252.25 488.09,229.43 364.99,394.22 		"/>
	</g>
</g>
</svg>
