GIT_SILENT Update Appstream for new release

1 job for v20.12.2 in 5 minutes and 50 seconds (queued for 66 minutes and 47 seconds)
latest
Status Name Job ID Coverage
  Build
failed build_clazy_clang_tidy #90378

00:05:50

 
Name Stage Failure
failed
build_clazy_clang_tidy Build
make[2]: *** [src/CMakeFiles/libkdebugsettings.dir/build.make:283: bin/libkdebugsettings.so.20.12.2] Error 1
make[1]: *** [CMakeFiles/Makefile2:268: src/CMakeFiles/libkdebugsettings.dir/all] Error 2
make: *** [Makefile:160: all] Error 2
Uploading artifacts for failed job
Uploading artifacts...
WARNING: JUnitTestResults.xml: no matching files
ERROR: No files to upload
Cleaning up file based variables
ERROR: Job failed: exit code 1