Minimal refactoring to move Account away from its previous base32 decoding implementation.

1 job for master in 10 minutes and 12 seconds (queued for 1 second)
Status Job ID Name Coverage
  Build
failed #16771
flatpak
flatpak

00:10:12

 
Name Stage Failure
failed
flatpak Build
make[3]: *** [Makefile:1414: all-recursive] Error 1
make[3]: Leaving directory '/run/build/oath-toolkit/liboath'
make[2]: *** [Makefile:1220: all] Error 2
make[2]: Leaving directory '/run/build/oath-toolkit/liboath'
make[1]: *** [Makefile:401: all-recursive] Error 1
make[1]: Leaving directory '/run/build/oath-toolkit'
make: *** [Makefile:357: all] Error 2
Error: module oath-toolkit: Child process exited with code 2
ERROR: Job failed: exit code 1