tab fix

9 jobs for feature/messageDeliveryStates in 80 minutes and 18 seconds (queued for 22 minutes and 40 seconds)
Status Job ID Name Coverage
  Test
passed #41019
clazy

00:01:22

passed #41020
qmllint

00:00:19

 
  Build
passed #41023
archlinux

00:01:29

passed #41022
debian-sid

00:01:36

passed #41021
neon-bionic

00:01:42

 
  Deploy
passed #41026
android

00:45:12

passed #41024
linux-appimage

00:25:40

passed #41027
mac-osxcross

00:07:20

failed #41025
allowed to fail
windows-mxe

00:02:56

 
Name Stage Failure
failed
windows-mxe Deploy
/builds/yugubich/kaidan/src/MessageModel.cpp:159:10: warning: enumeration value 'Sent' not handled in switch [-Wswitch]
/builds/yugubich/kaidan/src/MessageModel.cpp:159:10: warning: enumeration value 'Delivered' not handled in switch [-Wswitch]
/builds/yugubich/kaidan/src/MessageModel.cpp:159:10: warning: enumeration value 'Error' not handled in switch [-Wswitch]
make[2]: *** [CMakeFiles/kaidan.dir/build.make:2784: CMakeFiles/kaidan.dir/src/MessageModel.cpp.obj] Error 1
make[1]: *** [CMakeFiles/Makefile2:68: CMakeFiles/kaidan.dir/all] Error 2
make: *** [Makefile:95: all] Error 2
$ mv build/bin/kaidan.exe kaidan.exe
mv: cannot stat 'build/bin/kaidan.exe': No such file or directory
ERROR: Job failed: exit code 1